解决node-sass安装报错 make: *** [Release/obj.target/binding/src/binding.o] 错误 1

npm 前端 · best · 于 1个月前 发布 · 121 次阅读

大坑不说多说了, 类似错

npm ERR! In file included from ../src/binding.cpp:1:
npm ERR! In file included from ../../nan/nan.h:58:
npm ERR! In file included from /Users/chris/.node-gyp/16.13.1/include/node/node.h:63:
npm ERR! In file included from /Users/chris/.node-gyp/16.13.1/include/node/v8.h:30:
npm ERR! /Users/chris/.node-gyp/16.13.1/include/node/v8-internal.h:492:38: error: no template named 'remove_cv_t' in namespace 'std'; did you mean 'remove_cv'?
npm ERR!             !std::is_same<Data, std::remove_cv_t<T>>::value>::Perform(data);
npm ERR!                                 ~~~~~^~~~~~~~~~~
npm ERR!                                      remove_cv
npm ERR! /Library/Developer/CommandLineTools/SDKs/MacOSX12.1.sdk/usr/include/c++/v1/type_traits:710:50: note: 'remove_cv' declared here
npm ERR! template <class _Tp> struct _LIBCPP_TEMPLATE_VIS remove_cv
npm ERR!                                                  ^
npm ERR! 1 error generated.
npm ERR! make: *** [Release/obj.target/binding/src/binding.o] Error 1
npm ERR! gyp ERR! build error
npm ERR! gyp ERR! stack Error: `make` failed with exit code: 2
npm ERR! gyp ERR! stack     at ChildProcess.onExit (/Users/chris/Java/datax-web-ui/node_modules/node-gyp/lib/build.js:262:23)
npm ERR! gyp ERR! stack     at ChildProcess.emit (node:events:390:28)
npm ERR! gyp ERR! stack     at Process.ChildProcess._handle.onexit (node:internal/child_process:290:12)
npm ERR! gyp ERR! System Darwin 20.6.0
npm ERR! gyp ERR! command "/usr/local/bin/node" "/Users/chris/Java/datax-web-ui/node_modules/node-gyp/bin/node-gyp.js" "rebuild" "--verbose" "--libsass_ext=" "--libsass_cflags=" "--libsass_ldflags=" "--libsass_library="
npm ERR! gyp ERR! cwd /Users/chris/Java/datax-web-ui/node_modules/node-sass
npm ERR! gyp ERR! node -v v16.13.1
npm ERR! gyp ERR! node-gyp -v v3.8.0
npm ERR! gyp ERR! not ok
npm ERR! Build failed with error code: 1

node和node-sass版本不一致导致的,其对应关系如下图:

共收到 0 条回复
没有找到数据。
添加回复 (需要登录)
需要 登录 后方可回复, 如果你还没有账号请点击这里 注册